由于 PF_MAX > 44,内核编译失败

如何解决由于 PF_MAX > 44,内核编译失败

我有一个运行 Linux 内核 4.14.78 映像的 QEMU VM。

在主机(具有 96 个内核的服务器)上,我正在尝试为内核编译一个新的更新,并进行了一些更改。 为了使这个过程更快,我使用主机为目标 V​​M 进行编译。

为此,我遵循以下步骤:

  • /boot/config-4.14.78 文件从 VM 复制到主机

  • 把复制的文件放到内核源码根目录下,在my

    中重命名为.config
  • 运行 make clean 来清理它

  • 运行 make menuconfig 只是为了更新配置

  • 运行make -j$(nproc)

但是,我收到此错误:

  AS      arch/x86/purgatory/setup-x86_64.o
  CC      arch/x86/purgatory/sha256.o
  AS      arch/x86/purgatory/entry64.o
  CC      arch/x86/purgatory/string.o
In file included from scripts/selinux/mdp/mdp.c:49:
./security/selinux/include/classmap.h:245:2: error: #error New address family defined,please update secclass_map.
  245 | #error New address family defined,please update secclass_map.
      |  ^~~~~
make[3]: *** [scripts/Makefile.host:102: scripts/selinux/mdp/mdp] Error 1
make[2]: *** [scripts/Makefile.build:587: scripts/selinux/mdp] Error 2
make[2]: *** Waiting for unfinished jobs....
In file included from scripts/selinux/genheaders/genheaders.c:19:
./security/selinux/include/classmap.h:245:2: error: #error New address family defined,please update secclass_map.
      |  ^~~~~
  CHK     scripts/mod/devicetable-offsets.h
make[3]: *** [scripts/Makefile.host:102: scripts/selinux/genheaders/genheaders] Error 1
make[2]: *** [scripts/Makefile.build:587: scripts/selinux/genheaders] Error 2
make[1]: *** [scripts/Makefile.build:587: scripts/selinux] Error 2
make[1]: *** Waiting for unfinished jobs....

我已经检查了导致这种情况的原因,结果是:

include/linux/socket.h:211:#define AF_MAX       44  /* For now.. */
include/linux/socket.h:260:#define PF_MAX       AF_MAX

然后,我按照this solution在预处理时打印出PF_MAX的定义,结果发现PF_MAX45

In file included from scripts/selinux/mdp/mdp.c:49:
./security/selinux/include/classmap.h:247:9: note: #pragma message: 45
  247 | #pragma message(STRING(PF_MAX))
      |         ^~~~~~~
./security/selinux/include/classmap.h:250:2: error: #error New address family defined,please update secclass_map.
  250 | #error New address family defined,please update secclass_map.
      |  ^~~~~

这个 45 对我来说毫无意义,因为我刚刚检查过它应该是 44

我想知道构建是否考虑主机而不是目标?

P.S.:这些步骤在我的本地机器上运行良好,这是一台 8 核机器,查看内核版本:

uname -a
Linux campes-note 5.4.86 #1 SMP Fri Jan 1 16:26:25 -03 2021 x86_64 x86_64 x86_64 GNU/Linux

更新 1: 我尝试按照上述步骤在没有任何更改的情况下编译内核,但它也没有编译,我得到了同样的错误。

更新 2: 我发现不知何故,编译正在查看主机 /usr/src/linux-headers-x.x.x 文件。 相反,它应该指向与目标相同的版本。

为此,我尝试关注this tutorial,但没有成功。我在本教程中所述的步骤之一中遇到问题。

解决方法

(从现已删除的评论中收集)

我尝试自己构建 v4.14.78,然后是最新的可用 v4.14.214。我发现前者失败而后者构建。所以,我已经将 v4.14.116 一分为二,它首先正确构建。然后我简单地查看了更改,并在 Linux 稳定树中找到了 commit 760f8522ce08(“selinux: use kernel linux/socket.h for genheaders and mdp”),它解决了这个问题。

您可以尝试将其挑选到您的分支并再次编译。

版权声明:本文内容由互联网用户自发贡献,该文观点与技术仅代表作者本人。本站仅提供信息存储空间服务,不拥有所有权,不承担相关法律责任。如发现本站有涉嫌侵权/违法违规的内容, 请发送邮件至 dio@foxmail.com 举报,一经查实,本站将立刻删除。

相关推荐


使用本地python环境可以成功执行 import pandas as pd import matplotlib.pyplot as plt # 设置字体 plt.rcParams['font.sans-serif'] = ['SimHei'] # 能正确显示负号 p
错误1:Request method ‘DELETE‘ not supported 错误还原:controller层有一个接口,访问该接口时报错:Request method ‘DELETE‘ not supported 错误原因:没有接收到前端传入的参数,修改为如下 参考 错误2:cannot r
错误1:启动docker镜像时报错:Error response from daemon: driver failed programming external connectivity on endpoint quirky_allen 解决方法:重启docker -> systemctl r
错误1:private field ‘xxx‘ is never assigned 按Altʾnter快捷键,选择第2项 参考:https://blog.csdn.net/shi_hong_fei_hei/article/details/88814070 错误2:启动时报错,不能找到主启动类 #
报错如下,通过源不能下载,最后警告pip需升级版本 Requirement already satisfied: pip in c:\users\ychen\appdata\local\programs\python\python310\lib\site-packages (22.0.4) Coll
错误1:maven打包报错 错误还原:使用maven打包项目时报错如下 [ERROR] Failed to execute goal org.apache.maven.plugins:maven-resources-plugin:3.2.0:resources (default-resources)
错误1:服务调用时报错 服务消费者模块assess通过openFeign调用服务提供者模块hires 如下为服务提供者模块hires的控制层接口 @RestController @RequestMapping("/hires") public class FeignControl
错误1:运行项目后报如下错误 解决方案 报错2:Failed to execute goal org.apache.maven.plugins:maven-compiler-plugin:3.8.1:compile (default-compile) on project sb 解决方案:在pom.
参考 错误原因 过滤器或拦截器在生效时,redisTemplate还没有注入 解决方案:在注入容器时就生效 @Component //项目运行时就注入Spring容器 public class RedisBean { @Resource private RedisTemplate<String
使用vite构建项目报错 C:\Users\ychen\work>npm init @vitejs/app @vitejs/create-app is deprecated, use npm init vite instead C:\Users\ychen\AppData\Local\npm-
参考1 参考2 解决方案 # 点击安装源 协议选择 http:// 路径填写 mirrors.aliyun.com/centos/8.3.2011/BaseOS/x86_64/os URL类型 软件库URL 其他路径 # 版本 7 mirrors.aliyun.com/centos/7/os/x86
报错1 [root@slave1 data_mocker]# kafka-console-consumer.sh --bootstrap-server slave1:9092 --topic topic_db [2023-12-19 18:31:12,770] WARN [Consumer clie
错误1 # 重写数据 hive (edu)> insert overwrite table dwd_trade_cart_add_inc > select data.id, > data.user_id, > data.course_id, > date_format(
错误1 hive (edu)> insert into huanhuan values(1,'haoge'); Query ID = root_20240110071417_fe1517ad-3607-41f4-bdcf-d00b98ac443e Total jobs = 1
报错1:执行到如下就不执行了,没有显示Successfully registered new MBean. [root@slave1 bin]# /usr/local/software/flume-1.9.0/bin/flume-ng agent -n a1 -c /usr/local/softwa
虚拟及没有启动任何服务器查看jps会显示jps,如果没有显示任何东西 [root@slave2 ~]# jps 9647 Jps 解决方案 # 进入/tmp查看 [root@slave1 dfs]# cd /tmp [root@slave1 tmp]# ll 总用量 48 drwxr-xr-x. 2
报错1 hive> show databases; OK Failed with exception java.io.IOException:java.lang.RuntimeException: Error in configuring object Time taken: 0.474 se
报错1 [root@localhost ~]# vim -bash: vim: 未找到命令 安装vim yum -y install vim* # 查看是否安装成功 [root@hadoop01 hadoop]# rpm -qa |grep vim vim-X11-7.4.629-8.el7_9.x
修改hadoop配置 vi /usr/local/software/hadoop-2.9.2/etc/hadoop/yarn-site.xml # 添加如下 <configuration> <property> <name>yarn.nodemanager.res