Visual Studio 编译器错误:对委托构造函数的调用应是唯一的成员初始值设定项

如何解决Visual Studio 编译器错误:对委托构造函数的调用应是唯一的成员初始值设定项

我有这个程序(如下),它在 Visual Studios 中不断给我一些编译器错误。但是当我用 GCC 运行它时,我没有收到编译错误。我真的很想了解如何在 VS 中进行调试并且遇到了麻烦,因为编译器错误都指向代码的最后一行。谁能帮我弄清楚错误的含义以及如何修复它们?我也有 VS 给我的错误的图片:

#include <iostream>
#include <vector>
#include <fstream>
#include <string>
using namespace std;

struct Course
{
   string Course;
   int Credit = 0;
   int Score = 0;
   int Grade = 0;
};

struct Student

{
   int ID = 0;
   string Name = "";
   // Course arrCourse[maxCourseAmt];
     vector <Course>Courses;

};

int isInStudVector(vector<Student>vect,int target)
{
   int i = 0;
       while (i <= vect.size())
       {
           if (vect[i].ID == target)
               return i;
           i++;
       }
       return -1;

}



int main()
{
   fstream inputFile;
   string  fileName = "StudentRecords.txt";
   string token;
   //Student arrStu[9];
   vector<Student>Students;

   inputFile.open(fileName,ios::in);

   if (inputFile.is_open())

   {
       int index = 0;
       int ID;
       string Name;
       string CourseName;
       int Credit;
       int Score;

       while (!inputFile.eof())

       {

           inputFile >> ID >> Name >> CourseName >> Credit >> Score;

           int ii = isInStudVector(Students,ID);

           if (ii == -1) // The student record does not exist

           {
               Students.push_back(Student());

               Students[index].ID = ID;

               Students[index].Name = Name;
               Students[index].Courses.push_back(Course());
               Students[index].Courses[0].Course = CourseName;
               Students[index].Courses[0].Credit = Credit;
               Students[index].Courses[0].Score = Score;

               index++;

           }

           else /// The student exists

           {
               /// Add course and score to the existing student record
           }
       }
       inputFile.close();

   }

   else

       cout << "File cannot be opened.";

   return 0;

}

Rebuild started...
1>------ Rebuild All started: Project: hw1,Configuration: Debug Win32 ------
1>hw1.cpp
1>C:\Users\Rob\source\repos\hw1\hw1\hw1.cpp(28,14): warning C4018: '<=': signed/unsigned mismatch
1>C:\Users\Rob\source\repos\hw1\hw1\hw1.cpp(105,1): error C3511: 'Course': a call to a delegating constructor shall be the only member-initializer
1>C:\Users\Rob\source\repos\hw1\hw1\hw1.cpp(105,1): message : This diagnostic occurred in the compiler generated function 'Course::Course(Course &&)'
1>C:\Users\Rob\source\repos\hw1\hw1\hw1.cpp(105,1): error C2664: 'Course::Course(const Course &)': cannot convert argument 1 from 'std::string' to 'const Course &'
1>C:\Users\Rob\source\repos\hw1\hw1\hw1.cpp(105,1): message : Reason: cannot convert from 'std::string' to 'const Course'
1>C:\Users\Rob\source\repos\hw1\hw1\hw1.cpp(105,1): message : No user-defined-conversion operator available that can perform this conversion,or the operator cannot be called
1>C:\Users\Rob\source\repos\hw1\hw1\hw1.cpp(13,1): message : see declaration of 'Course::Course'
1>C:\Users\Rob\source\repos\hw1\hw1\hw1.cpp(105,1): error C2437: 'Credit': has already been initialized
1>C:\Users\Rob\source\repos\hw1\hw1\hw1.cpp(105,1): error C2437: 'Score': has already been initialized
1>C:\Users\Rob\source\repos\hw1\hw1\hw1.cpp(105,1): error C2437: 'Grade': has already been initialized
1>C:\Users\Rob\source\repos\hw1\hw1\hw1.cpp(105,1): message : This diagnostic occurred in the compiler generated function 'Course::Course(Course &&)'
1>Done building project "hw1.vcxproj" -- FAILED.
========== Rebuild All: 0 succeeded,1 failed,0 skipped ==========

解决方法

VS 不喜欢 string Course 中的成员 struct Course,因为“课程”是构造函数的隐式名称。重命名成员或结构名称。

,

我怀疑您遇到了编译器错误。 Both GCC and Clang compiles your code correctly,but not MSVC

然而,修复很简单。 MSVC 似乎不喜欢与类同名的成员。只需将 Course 更改为 Name 即可:

struct Course
{
   string Name;
   int Credit = 0;
   int Score = 0;
   int Grade = 0;
};

版权声明:本文内容由互联网用户自发贡献,该文观点与技术仅代表作者本人。本站仅提供信息存储空间服务,不拥有所有权,不承担相关法律责任。如发现本站有涉嫌侵权/违法违规的内容, 请发送邮件至 dio@foxmail.com 举报,一经查实,本站将立刻删除。

相关推荐


使用本地python环境可以成功执行 import pandas as pd import matplotlib.pyplot as plt # 设置字体 plt.rcParams[&#39;font.sans-serif&#39;] = [&#39;SimHei&#39;] # 能正确显示负号 p
错误1:Request method ‘DELETE‘ not supported 错误还原:controller层有一个接口,访问该接口时报错:Request method ‘DELETE‘ not supported 错误原因:没有接收到前端传入的参数,修改为如下 参考 错误2:cannot r
错误1:启动docker镜像时报错:Error response from daemon: driver failed programming external connectivity on endpoint quirky_allen 解决方法:重启docker -&gt; systemctl r
错误1:private field ‘xxx‘ is never assigned 按Altʾnter快捷键,选择第2项 参考:https://blog.csdn.net/shi_hong_fei_hei/article/details/88814070 错误2:启动时报错,不能找到主启动类 #
报错如下,通过源不能下载,最后警告pip需升级版本 Requirement already satisfied: pip in c:\users\ychen\appdata\local\programs\python\python310\lib\site-packages (22.0.4) Coll
错误1:maven打包报错 错误还原:使用maven打包项目时报错如下 [ERROR] Failed to execute goal org.apache.maven.plugins:maven-resources-plugin:3.2.0:resources (default-resources)
错误1:服务调用时报错 服务消费者模块assess通过openFeign调用服务提供者模块hires 如下为服务提供者模块hires的控制层接口 @RestController @RequestMapping(&quot;/hires&quot;) public class FeignControl
错误1:运行项目后报如下错误 解决方案 报错2:Failed to execute goal org.apache.maven.plugins:maven-compiler-plugin:3.8.1:compile (default-compile) on project sb 解决方案:在pom.
参考 错误原因 过滤器或拦截器在生效时,redisTemplate还没有注入 解决方案:在注入容器时就生效 @Component //项目运行时就注入Spring容器 public class RedisBean { @Resource private RedisTemplate&lt;String
使用vite构建项目报错 C:\Users\ychen\work&gt;npm init @vitejs/app @vitejs/create-app is deprecated, use npm init vite instead C:\Users\ychen\AppData\Local\npm-
参考1 参考2 解决方案 # 点击安装源 协议选择 http:// 路径填写 mirrors.aliyun.com/centos/8.3.2011/BaseOS/x86_64/os URL类型 软件库URL 其他路径 # 版本 7 mirrors.aliyun.com/centos/7/os/x86
报错1 [root@slave1 data_mocker]# kafka-console-consumer.sh --bootstrap-server slave1:9092 --topic topic_db [2023-12-19 18:31:12,770] WARN [Consumer clie
错误1 # 重写数据 hive (edu)&gt; insert overwrite table dwd_trade_cart_add_inc &gt; select data.id, &gt; data.user_id, &gt; data.course_id, &gt; date_format(
错误1 hive (edu)&gt; insert into huanhuan values(1,&#39;haoge&#39;); Query ID = root_20240110071417_fe1517ad-3607-41f4-bdcf-d00b98ac443e Total jobs = 1
报错1:执行到如下就不执行了,没有显示Successfully registered new MBean. [root@slave1 bin]# /usr/local/software/flume-1.9.0/bin/flume-ng agent -n a1 -c /usr/local/softwa
虚拟及没有启动任何服务器查看jps会显示jps,如果没有显示任何东西 [root@slave2 ~]# jps 9647 Jps 解决方案 # 进入/tmp查看 [root@slave1 dfs]# cd /tmp [root@slave1 tmp]# ll 总用量 48 drwxr-xr-x. 2
报错1 hive&gt; show databases; OK Failed with exception java.io.IOException:java.lang.RuntimeException: Error in configuring object Time taken: 0.474 se
报错1 [root@localhost ~]# vim -bash: vim: 未找到命令 安装vim yum -y install vim* # 查看是否安装成功 [root@hadoop01 hadoop]# rpm -qa |grep vim vim-X11-7.4.629-8.el7_9.x
修改hadoop配置 vi /usr/local/software/hadoop-2.9.2/etc/hadoop/yarn-site.xml # 添加如下 &lt;configuration&gt; &lt;property&gt; &lt;name&gt;yarn.nodemanager.res