同一Flutter项目问题​​中的Firebase ML-vision和admob插件-播放服务版本冲突

如何解决同一Flutter项目问题​​中的Firebase ML-vision和admob插件-播放服务版本冲突

对此感到非常沮丧-所以我在Flutter中有一个项目,其中涉及以下方面:

firebase_admob: ^0.10.2
firebase_ml_vision: ^0.9.9

虽然我只有firebase_ml_vision一切都能顺利编译,但是添加admob改变了这一点,现在我得到的错误是:

FAILURE: Build failed with an exception.

* What went wrong:
Could not determine the dependencies of task ':app:compileDebugJavaWithJavac'.
> In project 'app' a resolved Google Play services library dependency depends on another at an exact version (e.g. "[19.0.
  2]",but isn't being resolved to that version. Behavior exhibited by the library will be unknown.

  Dependency failing: com.google.android.gms:play-services-vision:20.0.0 -> com.google.android.gms:play-services-vision-co
  mmon@[19.0.2],but play-services-vision-common version was 19.1.0.

  The following dependencies are project dependencies that are direct or have transitive dependencies that lead to the art
  ifact with the issue.
  -- Project 'app' depends onto com.google.firebase:firebase-ml-vision@{strictly 24.1.0}
  -- Project 'app' depends on project 'firebase_ml_vision' which depends onto com.google.firebase:firebase-ml-vision@20.0.
  0
  -- Project 'app' depends onto com.google.android.gms:play-services-vision-common@{strictly 19.1.0}
  -- Project 'app' depends onto com.google.android.gms:play-services-vision-image-label@{strictly 18.0.4}
  -- Project 'app' depends onto com.google.android.gms:play-services-vision@{strictly 20.0.0}

  For extended debugging info execute Gradle from the command line with ./gradlew --info :app:assembleDebug to see the dep
  endency paths to the artifact. This error message came from the google-services Gradle plugin,report issues at https://
  github.com/google/play-services-plugins and disable by adding "googleServices { disableVersionCheck = true }" to your bu
  ild.gradle file.

到目前为止,我已经尝试了所有我能想到的东西,包括杂耍版本等。

有什么办法可以解决这个问题?

更新

经过更多实验后,我在build.gradle中添加了googleServices.disableVersionCheck = true,因此,显然,除了许多弃用警告(Hello Firebase)之外,这是真正的问题:

FAILURE: Build failed with an exception.

* What went wrong:
Execution failed for task ':app:checkDebugDuplicateClasses'.
> 1 exception was raised by workers:
  java.lang.RuntimeException: Duplicate class com.google.android.gms.internal.vision.zze found in modules jetified-play-services-vision-20.0.0-runtime.jar (com.google.android.gms:play-services-vision:20.0.0) and jetified-play-services-vision-common-19.1.0-runtime.jar (com.google.android.gms:play-services-vision-common:19.1.0)
  Duplicate class com.google.android.gms.internal.vision.zzf found in modules jetified-play-services-vision-20.0.0-runtime.jar (com.google.android.gms:play-services-vision:20.0.0) and jetified-play-services-vision-common-19.1.0-runtime.jar (com.google.android.gms:play-services-vision-common:19.1.0)
  Duplicate class com.google.android.gms.internal.vision.zzg found in modules jetified-play-services-vision-20.0.0-runtime.jar (com.google.android.gms:play-services-vision:20.0.0) and jetified-play-services-vision-common-19.1.0-runtime.jar (com.google.android.gms:play-services-vision-common:19.1.0)
  Duplicate class com.google.android.gms.internal.vision.zzh found in modules jetified-play-services-vision-20.0.0-runtime.jar (com.google.android.gms:play-services-vision:20.0.0) and jetified-play-services-vision-common-19.1.0-runtime.jar (com.google.android.gms:play-services-vision-common:19.1.0)
  Duplicate class com.google.android.gms.internal.vision.zzi found in modules jetified-play-services-vision-20.0.0-runtime.jar (com.google.android.gms:play-services-vision:20.0.0) and jetified-play-services-vision-common-19.1.0-runtime.jar (com.google.android.gms:play-services-vision-common:19.1.0)
  Duplicate class com.google.android.gms.internal.vision.zzv found in modules jetified-play-services-vision-20.0.0-runtime.jar (com.google.android.gms:play-services-vision:20.0.0) and jetified-play-services-vision-common-19.1.0-runtime.jar (com.google.android.gms:play-services-vision-common:19.1.0)
  Duplicate class com.google.android.gms.internal.vision.zzw found in modules jetified-play-services-vision-20.0.0-runtime.jar (com.google.android.gms:play-services-vision:20.0.0) and jetified-play-services-vision-common-19.1.0-runtime.jar (com.google.android.gms:play-services-vision-common:19.1.0)

  Go to the documentation to learn how to <a href="d.android.com/r/tools/classpath-sync-errors">Fix dependency resolution errors</a>.

虽然仍然没有解决办法。

更新2

在寻找解决方法时,我发现了解决“已知问题”的提示:https://firebase.google.com/support/release-notes/android#mlkit-self-serve-fixes

我不知道Flutter插件的作者也可以尝试实现它们吗?!

所以我尝试实现它,很明显的地方是firebase_ml_vision库的build.gradle文件(我不想在github上创建fork,所以只是出于测试目的,在驱动器上编辑了该文件),一行,并从上面链接的“解决方案”中添加了另外两行:

        api 'com.google.firebase:firebase-ml-vision:24.1.0'
        implementation 'com.google.android.gms:play-services-vision:20.1.1'
        implementation 'com.google.android.gms:play-services-vision-common:19.1.1'

原始行包含firebase-ml-vision:20.0.0

编译再次失败,但是,我没有放弃,只走了一步,只是尝试使这项工作变得可行,并且出于任何原因决定尝试在项目的apply plugin: 'com.google.gms.google-services'中注释掉android/app/build.gradle行文件。 进行此更改后,项目最终得以编译,但是,当然,禁用它会导致其他问题,例如应用程序未初始化Firebase插件,因此最终仍然是一个失败。搜索继续...

更新3

这是第三次的魅力-我决定再摆弄一点,然后再次将googleServices.disableVersionCheck = true添加到我的gradle文件中。有效。项目会编译,Firebase初始化可以正常进行,甚至admob标语都会显示,尽管每次刷新都会产生错误。叹。这几乎不是解决方案,任何人决定何时将此类库(带有此类混乱的“自助式”修复程序)推入生产环境。

解决方法

我在Firebase库中遇到了同样的问题,您应该可以将any放在库的版本旁边,如下所示:

firebase_admob: any
firebase_ml_vision: any

然后运行flutter pub get

然后检查您的pubspec.lock文件并检查库的版本,然后将其填充到pubspec.yaml文件中。

那您的矛盾就应该消失了。

让我知道我是否误解了您的问题,或者您需要进一步解释!

版权声明:本文内容由互联网用户自发贡献,该文观点与技术仅代表作者本人。本站仅提供信息存储空间服务,不拥有所有权,不承担相关法律责任。如发现本站有涉嫌侵权/违法违规的内容, 请发送邮件至 dio@foxmail.com 举报,一经查实,本站将立刻删除。

相关推荐


使用本地python环境可以成功执行 import pandas as pd import matplotlib.pyplot as plt # 设置字体 plt.rcParams[&#39;font.sans-serif&#39;] = [&#39;SimHei&#39;] # 能正确显示负号 p
错误1:Request method ‘DELETE‘ not supported 错误还原:controller层有一个接口,访问该接口时报错:Request method ‘DELETE‘ not supported 错误原因:没有接收到前端传入的参数,修改为如下 参考 错误2:cannot r
错误1:启动docker镜像时报错:Error response from daemon: driver failed programming external connectivity on endpoint quirky_allen 解决方法:重启docker -&gt; systemctl r
错误1:private field ‘xxx‘ is never assigned 按Altʾnter快捷键,选择第2项 参考:https://blog.csdn.net/shi_hong_fei_hei/article/details/88814070 错误2:启动时报错,不能找到主启动类 #
报错如下,通过源不能下载,最后警告pip需升级版本 Requirement already satisfied: pip in c:\users\ychen\appdata\local\programs\python\python310\lib\site-packages (22.0.4) Coll
错误1:maven打包报错 错误还原:使用maven打包项目时报错如下 [ERROR] Failed to execute goal org.apache.maven.plugins:maven-resources-plugin:3.2.0:resources (default-resources)
错误1:服务调用时报错 服务消费者模块assess通过openFeign调用服务提供者模块hires 如下为服务提供者模块hires的控制层接口 @RestController @RequestMapping(&quot;/hires&quot;) public class FeignControl
错误1:运行项目后报如下错误 解决方案 报错2:Failed to execute goal org.apache.maven.plugins:maven-compiler-plugin:3.8.1:compile (default-compile) on project sb 解决方案:在pom.
参考 错误原因 过滤器或拦截器在生效时,redisTemplate还没有注入 解决方案:在注入容器时就生效 @Component //项目运行时就注入Spring容器 public class RedisBean { @Resource private RedisTemplate&lt;String
使用vite构建项目报错 C:\Users\ychen\work&gt;npm init @vitejs/app @vitejs/create-app is deprecated, use npm init vite instead C:\Users\ychen\AppData\Local\npm-
参考1 参考2 解决方案 # 点击安装源 协议选择 http:// 路径填写 mirrors.aliyun.com/centos/8.3.2011/BaseOS/x86_64/os URL类型 软件库URL 其他路径 # 版本 7 mirrors.aliyun.com/centos/7/os/x86
报错1 [root@slave1 data_mocker]# kafka-console-consumer.sh --bootstrap-server slave1:9092 --topic topic_db [2023-12-19 18:31:12,770] WARN [Consumer clie
错误1 # 重写数据 hive (edu)&gt; insert overwrite table dwd_trade_cart_add_inc &gt; select data.id, &gt; data.user_id, &gt; data.course_id, &gt; date_format(
错误1 hive (edu)&gt; insert into huanhuan values(1,&#39;haoge&#39;); Query ID = root_20240110071417_fe1517ad-3607-41f4-bdcf-d00b98ac443e Total jobs = 1
报错1:执行到如下就不执行了,没有显示Successfully registered new MBean. [root@slave1 bin]# /usr/local/software/flume-1.9.0/bin/flume-ng agent -n a1 -c /usr/local/softwa
虚拟及没有启动任何服务器查看jps会显示jps,如果没有显示任何东西 [root@slave2 ~]# jps 9647 Jps 解决方案 # 进入/tmp查看 [root@slave1 dfs]# cd /tmp [root@slave1 tmp]# ll 总用量 48 drwxr-xr-x. 2
报错1 hive&gt; show databases; OK Failed with exception java.io.IOException:java.lang.RuntimeException: Error in configuring object Time taken: 0.474 se
报错1 [root@localhost ~]# vim -bash: vim: 未找到命令 安装vim yum -y install vim* # 查看是否安装成功 [root@hadoop01 hadoop]# rpm -qa |grep vim vim-X11-7.4.629-8.el7_9.x
修改hadoop配置 vi /usr/local/software/hadoop-2.9.2/etc/hadoop/yarn-site.xml # 添加如下 &lt;configuration&gt; &lt;property&gt; &lt;name&gt;yarn.nodemanager.res